Target
5-hydroxytryptamine receptor 1A
Ligand
BDBM50416853
Substrate
Meas. Tech.
ChEMBL_663470 (CHEMBL1251069)
Ki
11.75±n/a nM
Citation
 Carrieri, APiergentili, ADel Bello, FGiannella, MPigini, MLeonardi, AFanelli, FQuaglia, W Structure-activity relationships in 1,4-benzodioxan-related compounds. 10. Novela1-adrenoreceptor antagonists related to openphendioxan: synthesis, biological evaluation, anda1d computational study. Bioorg Med Chem 18:7065-77 (2010)  
Target
Name:
5-hydroxytryptamine receptor 1A
Synonyms:
5-HT-1A 5-hydroxytryptamine receptor 1A (5-HT-1A) ADRB2RL1 Dopamine D2 receptor and serotonin 1a receptor HTR1A | Serotonin receptor 1A
Type:
Mol. Mass.:
46122.49
Organism:
Homo sapiens (Human)
Description:
Residue:
422
  
Inhibitor
Name:
BDBM50416853
Synonyms:
CHEMBL43116
Type:
Small organic molecule
Emp. Form.:
C25H29NO5
Mol. Mass.:
423.5015
SMILES:
COc1cccc(OC)c1OCCNCCOc1ccccc1OCc1ccccc1
: