Target
Neuropeptide Y receptor type 2
Ligand
BDBM50417477
Substrate
Meas. Tech.
ChEMBL_687956 (CHEMBL1291628)
Ki
79.43±n/a nM
Citation
 Lunniss, GEBarnes, AABarton, NBiagetti, MBianchi, FBlowers, SMCaberlotto, LLEmmons, AHolmes, IPMontanari, DNorris, RPuckey, GVWalters, DJWatson, SPWillis, J The identification of a series of novel, soluble non-peptidic neuropeptide Y Y2 receptor antagonists. Bioorg Med Chem Lett 20:7341-4 (2010)  
Target
Name:
Neuropeptide Y receptor type 2
Synonyms:
NPY-Y2 NPY2-R NPY2R_HUMAN Y2 receptor | neuropeptide Y receptor Y2
Type:
Enzyme Catalytic Domain
Mol. Mass.:
42734.65
Organism:
Homo sapiens (Human)
Description:
NPY-Y2 NPY2R HUMAN::P49146
Residue:
381
  
Inhibitor
Name:
BDBM50417477
Synonyms:
CHEMBL1288049
Type:
Small organic molecule
Emp. Form.:
C27H34ClN3O
Mol. Mass.:
452.031
SMILES:
Clc1cc(NC(=O)C2(CCC2)c2ccccc2)ccc1N1CCC(CC1)N1CCCCC1
: