Target
Neuropeptide Y receptor type 2
Ligand
BDBM50417495
Substrate
Meas. Tech.
ChEMBL_687956 (CHEMBL1291628)
Ki
125.89±n/a nM
Citation
 Lunniss, GEBarnes, AABarton, NBiagetti, MBianchi, FBlowers, SMCaberlotto, LLEmmons, AHolmes, IPMontanari, DNorris, RPuckey, GVWalters, DJWatson, SPWillis, J The identification of a series of novel, soluble non-peptidic neuropeptide Y Y2 receptor antagonists. Bioorg Med Chem Lett 20:7341-4 (2010)  
Target
Name:
Neuropeptide Y receptor type 2
Synonyms:
NPY-Y2 NPY2-R NPY2R_HUMAN Y2 receptor | neuropeptide Y receptor Y2
Type:
Enzyme Catalytic Domain
Mol. Mass.:
42734.65
Organism:
Homo sapiens (Human)
Description:
NPY-Y2 NPY2R HUMAN::P49146
Residue:
381
  
Inhibitor
Name:
BDBM50417495
Synonyms:
CHEMBL1287870
Type:
Small organic molecule
Emp. Form.:
C22H25ClFN3O2
Mol. Mass.:
417.904
SMILES:
CC(C)(C)C(=O)Nc1ccc(N2CCN(CC2)C(=O)c2ccccc2F)c(Cl)c1
: