Target
Corticotropin-releasing factor receptor 1
Ligand
BDBM50417512
Substrate
Meas. Tech.
ChEMBL_685890 (CHEMBL1292646)
Ki
25.12±n/a nM
Citation
 Tellew, JELanier, MMoorjani, MLin, ELuo, ZSlee, DHZhang, XHoare, SRGrigoriadis, DESt Denis, YDi Fabio, RDi Modugno, ESaunders, JWilliams, JP Discovery of NBI-77860/GSK561679, a potent corticotropin-releasing factor (CRF1) receptor antagonist with improved pharmacokinetic properties. Bioorg Med Chem Lett 20:7259-64 (2010)  
Target
Name:
Corticotropin-releasing factor receptor 1
Synonyms:
CRF-R CRF1 CRFR1 CRH-R 1 CRHR1 Corticotropin-releasing factor receptor 1 (CRF-1) Corticotropin-releasing hormone receptor 1
Type:
Enzyme
Mol. Mass.:
50744.31
Organism:
Homo sapiens (Human)
Description:
P34998
Residue:
444
  
Inhibitor
Name:
BDBM50417512
Synonyms:
CHEMBL1287878
Type:
Small organic molecule
Emp. Form.:
C21H24N6O2
Mol. Mass.:
392.4543
SMILES:
COc1ccc(-c2c(C)nn3c(NC(C)c4nc(C)no4)cc(C)nc23)c(C)c1
: