Target
Vitamin D3 receptor
Ligand
BDBM50417520
Substrate
Meas. Tech.
ChEMBL_695917 (CHEMBL1641104)
Ki
0.06±n/a nM
Citation
 Grzywacz, PChiellini, GPlum, LAClagett-Dame, MDeLuca, HF Removal of the 26-methyl group from 19-nor-1a,25-dihydroxyvitamin D3 markedly reduces in vivo calcemic activity without altering in vitro VDR binding, HL-60 cell differentiation, and transcription. J Med Chem 53:8642-9 (2010)  
Target
Name:
Vitamin D3 receptor
Synonyms:
Nr1i1 Vdr | Vitamin D receptor
Type:
PROTEIN
Mol. Mass.:
47811.07
Organism:
Rattus norvegicus
Description:
ChEMBL_1505946
Residue:
423
  
Inhibitor
Name:
BDBM50417520
Synonyms:
CHEMBL1630753
Type:
Small organic molecule
Emp. Form.:
C27H42O3
Mol. Mass.:
414.6206
SMILES:
C[C@H](O)CCC[C@H](C)[C@H]1CC[C@H]2\C(CCC[C@]12C)=C\C=C1\C[C@@H](O)C(=C)[C@H](O)C1=C
: