Target
Prostaglandin D2 receptor
Ligand
BDBM50417719
Substrate
Meas. Tech.
ChEMBL_701282 (CHEMBL1648902)
IC50
2.69±n/a nM
Citation
 Mu, LAguiar, JArdati, ACao, BGardner, CJGillespy, THarris, KLim, SMarcus, RMorize, IParkar, AStefany, DLi, YVaz, RJCirovic, DA Understanding DP receptor antagonism using a CoMSIA approach. Bioorg Med Chem Lett 21:66-75 (2010)  
Target
Name:
Prostaglandin D2 receptor
Synonyms:
PD2R_HUMAN Prostaglandin D2 Prostanoid DP receptor
Type:
Enzyme
Mol. Mass.:
40288.87
Organism:
Homo sapiens (Human)
Description:
Q13258
Residue:
359
  
Inhibitor
Name:
BDBM50417719
Synonyms:
CHEMBL1644204
Type:
Small organic molecule
Emp. Form.:
C24H25Cl2N3O3
Mol. Mass.:
474.38
SMILES:
COCc1nc(NCCc2ccc(Cl)cc2Cl)cc(n1)-c1cccc(c1)C(C)(C)C(O)=O
: