Target
Glucocorticoid receptor
Ligand
BDBM50417875
Substrate
Meas. Tech.
ChEMBL_716758 (CHEMBL1670640)
IC50
0.316±n/a nM
Citation
 Diallo, HAngell, DCBarnett, HABiggadike, KCoe, DMCooper, TWCraven, AGray, JRHouse, DJack, TIKeeling, SPMacdonald, SJMcLay, IMOliver, STaylor, SJUings, IJWellaway, N Discovery of a potent series of non-steroidal nona-trifluoromethyl carbinol glucocorticoid receptor agonists with reduced lipophilicity. Bioorg Med Chem Lett 21:1126-33 (2011)  
Target
Name:
Glucocorticoid receptor
Synonyms:
GCR_HUMAN GRL Glucocorticoid receptor (GRFP) Nuclear receptor subfamily 3 group C member 1
Type:
Enzyme
Mol. Mass.:
85656.87
Organism:
Homo sapiens (Human)
Description:
P04150
Residue:
777
  
Inhibitor
Name:
BDBM50417875
Synonyms:
CHEMBL1668063
Type:
Small organic molecule
Emp. Form.:
C26H22Cl2F4N4O2
Mol. Mass.:
569.378
SMILES:
CCN(C[C@](O)(CNc1cccc2n(ncc12)-c1ccc(F)cc1)C(F)(F)F)C(=O)c1c(Cl)cccc1Cl
: