Target
Potassium voltage-gated channel subfamily H member 2
Ligand
BDBM31774
Substrate
Meas. Tech.
ChEMBL_725152 (CHEMBL1676103)
IC50
3019.95±n/a nM
Citation
 Sinha, NSen, S Predicting hERG activities of compounds from their 3D structures: development and evaluation of a global descriptors based QSAR model. Eur J Med Chem 46:618-30 (2011)  
Target
Name:
Potassium voltage-gated channel subfamily H member 2
Synonyms:
1,3-beta-glucan synthase component GLS2 ERG Eag-related protein 1 Ether-a-go-go-related gene (HERG) Ether-a-go-go-related gene potassium channel 1 Ether-a-go-go-related gene potassium channel 1 (hERG1) Ether-a-go-go-related protein 1 H-ERG KCNH2 Potassium voltage-gated channel subfamily H member 2 (hERG) Voltage-gated potassium channel subunit Kv11.1 hERG Potassium Channel 1 | putative potassium channel subunit
Type:
Multi-pass membrane protein
Mol. Mass.:
126672.65
Organism:
Homo sapiens (Human)
Description:
Q12809
Residue:
1159
  
Inhibitor
Name:
BDBM31774
Synonyms:
CHEMBL104 Clotrimazole Mycelex cid_2812
Type:
Small organic molecule
Emp. Form.:
C22H17ClN2
Mol. Mass.:
344.837
SMILES:
Clc1ccccc1C(c1ccccc1)(c1ccccc1)n1ccnc1
: