Target
Amine oxidase [flavin-containing] A
Ligand
BDBM15590
Substrate
Meas. Tech.
ChEMBL_739780 (CHEMBL1763606)
Ki
89949758.15±n/a nM
Citation
 Shelke, SMBhosale, SHDash, RCSuryawanshi, MRMahadik, KR Exploration of new scaffolds as potential MAO-A inhibitors using pharmacophore and 3D-QSAR based in silico screening. Bioorg Med Chem Lett 21:2419-24 (2011)  
Target
Name:
Amine oxidase [flavin-containing] A
Synonyms:
AOFA_HUMAN MAO-A Monoamine oxidase Monoamine oxidase type A (MAO A) Monoamine oxidase type A (MAOA)
Type:
Protein
Mol. Mass.:
59689.53
Organism:
Homo sapiens (Human)
Description:
P21397
Residue:
527
  
Inhibitor
Name:
BDBM15590
Synonyms:
N-(4-Phenylbutyl),N-methyl 1H-pyrrole-2-carboxamide pyrrole inhibitor 16
Type:
Small organic molecule
Emp. Form.:
C16H20N2O
Mol. Mass.:
256.3428
SMILES:
CN(CCCCc1ccccc1)C(=O)c1ccc[nH]1
: