Target
Amine oxidase [flavin-containing] A
Ligand
BDBM15606
Substrate
Meas. Tech.
ChEMBL_739780 (CHEMBL1763606)
Ki
19998618.7±n/a nM
Citation
 Shelke, SMBhosale, SHDash, RCSuryawanshi, MRMahadik, KR Exploration of new scaffolds as potential MAO-A inhibitors using pharmacophore and 3D-QSAR based in silico screening. Bioorg Med Chem Lett 21:2419-24 (2011)  
Target
Name:
Amine oxidase [flavin-containing] A
Synonyms:
AOFA_HUMAN MAO-A Monoamine oxidase Monoamine oxidase type A (MAO A) Monoamine oxidase type A (MAOA)
Type:
Protein
Mol. Mass.:
59689.53
Organism:
Homo sapiens (Human)
Description:
P21397
Residue:
527
  
Inhibitor
Name:
BDBM15606
Synonyms:
(R)-N-(alpha-Cyclohexylethyl)-N-methyl,N-(pyrrol-2-ylmethyl)-amide pyrrole inhibitor 31
Type:
Small organic molecule
Emp. Form.:
C14H24N2
Mol. Mass.:
220.3538
SMILES:
C[C@H](C1CCCCC1)N(C)Cc1ccc[nH]1
: