Target
Amine oxidase [flavin-containing] A
Ligand
BDBM15589
Substrate
Meas. Tech.
ChEMBL_739780 (CHEMBL1763606)
Ki
54954087.39±n/a nM
Citation
 Shelke, SMBhosale, SHDash, RCSuryawanshi, MRMahadik, KR Exploration of new scaffolds as potential MAO-A inhibitors using pharmacophore and 3D-QSAR based in silico screening. Bioorg Med Chem Lett 21:2419-24 (2011)  
Target
Name:
Amine oxidase [flavin-containing] A
Synonyms:
AOFA_HUMAN MAO-A Monoamine oxidase Monoamine oxidase type A (MAO A) Monoamine oxidase type A (MAOA)
Type:
Protein
Mol. Mass.:
59689.53
Organism:
Homo sapiens (Human)
Description:
P21397
Residue:
527
  
Inhibitor
Name:
BDBM15589
Synonyms:
N-(4-Phenylbutyl)-1H-pyrrole-2-carboxamide | pyrrole inhibitor 15
Type:
Small organic molecule
Emp. Form.:
C15H18N2O
Mol. Mass.:
242.3162
SMILES:
O=C(NCCCCc1ccccc1)c1ccc[nH]1
: