Target
Integrin alpha-V/beta-3
Ligand
BDBM50237601
Substrate
Meas. Tech.
ChEMBL_739718 (CHEMBL1763544)
IC50
325±n/a nM
Citation
 Ye, YXu, BNikiforovich, GVBloch, SAchilefu, S Exploring new near-infrared fluorescent disulfide-based cyclic RGD peptide analogs for potential integrin-targeted optical imaging. Bioorg Med Chem Lett 21:2116-20 (2011)  
Target
Name:
Integrin alpha-V/beta-3
Synonyms:
ITGAV/ITGB3 | Integrin beta-3/Vitronectin receptor alpha
Type:
Enzyme
Mol. Mass.:
Description:
Components:
This complex has 2 components.
Component 1
Name:
Integrin alpha-V
Synonyms:
ITAV_HUMAN Integrin alpha-V/alpha-5 VNRA Vitronectin receptor | Vitronectin receptor subunit alpha
Type:
PROTEIN
Mol. Mass.:
116024.92
Organism:
Homo sapiens (Human)
Description:
ChEMBL_582336
Residue:
1048
  
Component 2
Name:
Integrin beta-3
Synonyms:
CD_antigen=CD61 GPIIIa ITGB3 Platelet membrane glycoprotein IIIa
Type:
Protein
Mol. Mass.:
87038.91
Organism:
Homo sapiens (Human)
Description:
P05106
Residue:
788
  
Inhibitor
Name:
BDBM50237601
Synonyms:
CHEMBL411941 [(2S,5R,8S,11S)-5-Benzyl-11-(3-guanidino-propyl)-8-isopropyl-3,6,9,12,15-pentaoxo-1,4,7,10,13pentaaza-cyclopentadec-2-yl]-acetic acid c(RGDfV) c[Arg-Gly-Asp-(R)-Phe-Val] | cyclo(Arg-Gly-Asp-D-Phe-Val)
Type:
Small organic molecule
Emp. Form.:
C26H38N8O7
Mol. Mass.:
574.6293
SMILES:
[#6]-[#6](-[#6])-[#6@@H]-1-[#7]-[#6](=O)-[#6@@H](-[#6]-c2ccccc2)-[#7]-[#6](=O)-[#6@H](-[#6]-[#6](-[#8])=O)-[#7]-[#6](=O)-[#6]-[#7]-[#6](=O)-[#6@H](-[#6]-[#6]-[#6]\[#7]=[#6](/[#7])-[#7])-[#7]-[#6]-1=O
: