Target
Integrin alpha-V/beta-3
Ligand
BDBM50340878
Substrate
Meas. Tech.
ChEMBL_739718 (CHEMBL1763544)
IC50
>10000±n/a nM
Citation
 Ye, YXu, BNikiforovich, GVBloch, SAchilefu, S Exploring new near-infrared fluorescent disulfide-based cyclic RGD peptide analogs for potential integrin-targeted optical imaging. Bioorg Med Chem Lett 21:2116-20 (2011)  
Target
Name:
Integrin alpha-V/beta-3
Synonyms:
ITGAV/ITGB3 | Integrin beta-3/Vitronectin receptor alpha
Type:
Enzyme
Mol. Mass.:
Description:
Components:
This complex has 2 components.
Component 1
Name:
Integrin alpha-V
Synonyms:
ITAV_HUMAN Integrin alpha-V/alpha-5 VNRA Vitronectin receptor | Vitronectin receptor subunit alpha
Type:
PROTEIN
Mol. Mass.:
116024.92
Organism:
Homo sapiens (Human)
Description:
ChEMBL_582336
Residue:
1048
  
Component 2
Name:
Integrin beta-3
Synonyms:
CD_antigen=CD61 GPIIIa ITGB3 Platelet membrane glycoprotein IIIa
Type:
Protein
Mol. Mass.:
87038.91
Organism:
Homo sapiens (Human)
Description:
P05106
Residue:
788
  
Inhibitor
Name:
BDBM50340878
Synonyms:
2-(7-(3-(3-((4R,7S,10S,13S,16R)-4-carbamoyl-7-(carboxymethyl)-13-(3-guanidinopropyl)-10-(4-hydroxybenzyl)-6,9,12,15-tetraoxo-1,2-dithia-5,8,11,14-tetraazacycloheptadecan-16-ylamino)-3-oxopropyl)-1,1-dimethyl-1H-benzo[e]indol-2(3H)-ylidene)hepta-1,3,5-trienyl)-3-(2-carboxyethyl)-1,1-dimethyl-1H-benzo[e]indolium | CHEMBL1761777
Type:
Small organic molecule
Emp. Form.:
C66H76N11O11S2
Mol. Mass.:
1263.506
SMILES:
[#6]C1([#6])\[#6](=[#6]/[#6]=[#6]/[#6]=[#6]-[#6]=[#6]-[#6]2=[#7+](-[#6]-[#6]-[#6](=O)-[#7]-[#6@H]-3-[#6]-[#16]-[#16]-[#6]-[#6@H](-[#7]-[#6](=O)-[#6@H](-[#6]-[#6](-[#8])=O)-[#7]-[#6](=O)-[#6@H](-[#6]-c4ccc(-[#8])cc4)-[#7]-[#6](=O)-[#6@H](-[#6]-[#6]-[#6]\[#7]=[#6](\[#7])-[#7])-[#7]-[#6]-3=O)-[#6](-[#7])=O)-c3ccc4ccccc4c3C2([#6])[#6])-[#7](-[#6]-[#6]-[#6](-[#8])=O)-c2ccc3ccccc3c12
: