Target
GABA-A receptor; alpha-2/beta-3/gamma-2
Ligand
BDBM50418445
Substrate
Meas. Tech.
ChEMBL_751257 (CHEMBL1787625)
Ki
1±n/a nM
Citation
 Alhambra, CBecker, CBlake, TChang, AHDamewood, JRDaniels, TDembofsky, BTGurley, DAHall, JEHerzog, KJHorchler, CLOhnmacht, CJSchmiesing, RJDudley, ARibadeneira, MDKnappenberger, KSMaciag, CStein, MMChopra, MLiu, XFChristian, EPArriza, JLChapdelaine, MJ Development and SAR of functionally selective allosteric modulators of GABAA receptors. Bioorg Med Chem 19:2927-38 (2011)  
Target
Name:
GABA-A receptor; alpha-2/beta-3/gamma-2
Synonyms:
GABA receptor alpha-2/beta-3/gamma-2 subunit | Gamma-aminobutyric acid receptor subunit alpha-2/beta-3/gamma-2
Type:
Mol. Mass.:
Description:
ASSAY_ID of ChEMBL is 2148174
Components:
This complex has 3 components.
Component 1
Name:
Gamma-aminobutyric acid receptor subunit gamma-2
Synonyms:
GABA(A) receptor subunit gamma-2 GBRG2_HUMAN
Type:
PROTEIN
Mol. Mass.:
54172.74
Organism:
Homo sapiens (Human)
Description:
EBI_217
Residue:
467
  
Component 2
Name:
Gamma-aminobutyric acid receptor subunit beta-3
Synonyms:
GABA A receptor alpha-4/beta-3/gamma-2 GABA-A receptor GBRB3_HUMAN | agonist GABA site
Type:
PROTEIN
Mol. Mass.:
54130.51
Organism:
Homo sapiens (Human)
Description:
ChEMBL_448071
Residue:
473
  
Component 3
Name:
Gamma-aminobutyric acid receptor subunit alpha-2
Synonyms:
GABA receptor alpha-2 subunit GBRA2_HUMAN | Gamma-aminobutyric acid receptor subunit alpha-2 (GABRA2)
Type:
Protein
Mol. Mass.:
51338.78
Organism:
Homo sapiens (Human)
Description:
P47869
Residue:
451
  
Inhibitor
Name:
BDBM50418445
Synonyms:
CHEMBL1783245
Type:
Small organic molecule
Emp. Form.:
C16H22N4O
Mol. Mass.:
286.3721
SMILES:
CCCNC(=O)c1nnc2c(CC(C)C)cccc2c1N
: