Target
Epidermal growth factor receptor
Ligand
BDBM4453
Substrate
Meas. Tech.
ChEMBL_753968 (CHEMBL1798351)
IC50
812.83±n/a nM
Citation
 San Juan, AA Towards predictive inhibitor design for the EGFR autophosphorylation activity. Eur J Med Chem 43:781-91 (2008)  
Target
Name:
Epidermal growth factor receptor
Synonyms:
EGF Receptor Substrate EGFR_HUMAN ERBB1 Epidermal Growth Factor Receptor erbB-1 Epidermal growth factor receptor (EGFR) HER1 Proto-oncogene c-ErbB-1 Tyrosine-Protein Kinase ErbB-1
Type:
Receptor Kinase Domain
Mol. Mass.:
134279.59
Organism:
Homo sapiens (Human)
Description:
P00533
Residue:
1210
  
Inhibitor
Name:
BDBM4453
Synonyms:
4-(3-Aminophenylamino)-6,7-dimethoxyquinoline-3-carbonitrile 6,7-dialkoxyquinoline-3-carbonitrile deriv. 16
Type:
Small organic molecule
Emp. Form.:
C18H16N4O2
Mol. Mass.:
320.3452
SMILES:
COc1cc2ncc(C#N)c(Nc3cccc(N)c3)c2cc1OC
: