Target
Beta-2 adrenergic receptor
Ligand
BDBM50416060
Substrate
Meas. Tech.
ChEMBL_773263 (CHEMBL1840215)
EC50
0.398107±n/a nM
Citation
 Procopiou, PABarrett, VJFord, AJLooker, BELunniss, GENeedham, DSmith, CESomers, G The discovery of long-acting saligeninß2 adrenergic receptor agonists incorporating a urea group. Bioorg Med Chem 19:6026-32 (2011)  
Target
Name:
Beta-2 adrenergic receptor
Synonyms:
ADRB2 ADRB2_HUMAN Beta-2 adrenoceptor | Beta-2 adrenoreceptor
Type:
Mol. Mass.:
46461.69
Organism:
Homo sapiens (Human)
Description:
P07550
Residue:
413
  
Inhibitor
Name:
BDBM50416060
Synonyms:
4-(2-((6-((2-(((2,6-dichlorophenyl)methyl)oxy)ethyl)oxy)hexyl)amino)-1-hydroxyethyl)-2-(hydroxymethyl)phenol VILANTEROL
Type:
Small organic molecule
Emp. Form.:
C24H33Cl2NO5
Mol. Mass.:
486.429
SMILES:
OCc1cc(ccc1O)[C@@H](O)CNCCCCCCOCCOCc1c(Cl)cccc1Cl
: