Target
Beta-1 adrenergic receptor
Ligand
BDBM50419316
Substrate
Meas. Tech.
ChEMBL_773265 (CHEMBL1840217)
EC50
32±n/a nM
Citation
 Procopiou, PABarrett, VJFord, AJLooker, BELunniss, GENeedham, DSmith, CESomers, G The discovery of long-acting saligeninß2 adrenergic receptor agonists incorporating a urea group. Bioorg Med Chem 19:6026-32 (2011)  
Target
Name:
Beta-1 adrenergic receptor
Synonyms:
ADRB1 ADRB1_HUMAN Beta-1 adrenoceptor adrenergic Beta1
Type:
G Protein-Coupled Receptor (GPCR)
Mol. Mass.:
51338.40
Organism:
Homo sapiens (Human)
Description:
P08588
Residue:
477
  
Inhibitor
Name:
BDBM50419316
Synonyms:
CHEMBL1835856
Type:
Small organic molecule
Emp. Form.:
C28H43N3O5
Mol. Mass.:
501.6581
SMILES:
CCNC(=O)Nc1ccc(CCCCOCCCCCCNC[C@H](O)c2ccc(O)c(CO)c2)cc1
: