Target
Beta-3 adrenergic receptor
Ligand
BDBM50419314
Substrate
Meas. Tech.
ChEMBL_773266 (CHEMBL1840218)
EC50
16±n/a nM
Citation
 Procopiou, PABarrett, VJFord, AJLooker, BELunniss, GENeedham, DSmith, CESomers, G The discovery of long-acting saligeninß2 adrenergic receptor agonists incorporating a urea group. Bioorg Med Chem 19:6026-32 (2011)  
Target
Name:
Beta-3 adrenergic receptor
Synonyms:
ADRB3 ADRB3_HUMAN Beta-2 adrenergic receptor and beta-3 adrenergic receptor Beta-3 adrenoreceptor | adrenergic Beta3
Type:
G Protein-Coupled Receptor (GPCR)
Mol. Mass.:
43534.88
Organism:
Homo sapiens (Human)
Description:
Residue:
408
  
Inhibitor
Name:
BDBM50419314
Synonyms:
CHEMBL1835857
Type:
Small organic molecule
Emp. Form.:
C27H41N3O5
Mol. Mass.:
487.6315
SMILES:
NC(=O)NCc1cccc(CCCCOCCCCCCNC[C@H](O)c2ccc(O)c(CO)c2)c1
: