Target
Beta-3 adrenergic receptor
Ligand
BDBM50416060
Substrate
Meas. Tech.
ChEMBL_773266 (CHEMBL1840218)
EC50
794±n/a nM
Citation
 Procopiou, PABarrett, VJFord, AJLooker, BELunniss, GENeedham, DSmith, CESomers, G The discovery of long-acting saligeninß2 adrenergic receptor agonists incorporating a urea group. Bioorg Med Chem 19:6026-32 (2011)  
Target
Name:
Beta-3 adrenergic receptor
Synonyms:
ADRB3 ADRB3_HUMAN Beta-2 adrenergic receptor and beta-3 adrenergic receptor Beta-3 adrenoreceptor | adrenergic Beta3
Type:
G Protein-Coupled Receptor (GPCR)
Mol. Mass.:
43534.88
Organism:
Homo sapiens (Human)
Description:
Residue:
408
  
Inhibitor
Name:
BDBM50416060
Synonyms:
4-(2-((6-((2-(((2,6-dichlorophenyl)methyl)oxy)ethyl)oxy)hexyl)amino)-1-hydroxyethyl)-2-(hydroxymethyl)phenol VILANTEROL
Type:
Small organic molecule
Emp. Form.:
C24H33Cl2NO5
Mol. Mass.:
486.429
SMILES:
OCc1cc(ccc1O)[C@@H](O)CNCCCCCCOCCOCc1c(Cl)cccc1Cl
: