Target
Beta-3 adrenergic receptor
Ligand
BDBM50151720
Substrate
Meas. Tech.
ChEMBL_773266 (CHEMBL1840218)
EC50
25±n/a nM
Citation
 Procopiou, PABarrett, VJFord, AJLooker, BELunniss, GENeedham, DSmith, CESomers, G The discovery of long-acting saligeninß2 adrenergic receptor agonists incorporating a urea group. Bioorg Med Chem 19:6026-32 (2011)  
Target
Name:
Beta-3 adrenergic receptor
Synonyms:
ADRB3 ADRB3_HUMAN Beta-2 adrenergic receptor and beta-3 adrenergic receptor Beta-3 adrenoreceptor | adrenergic Beta3
Type:
G Protein-Coupled Receptor (GPCR)
Mol. Mass.:
43534.88
Organism:
Homo sapiens (Human)
Description:
Residue:
408
  
Inhibitor
Name:
BDBM50151720
Synonyms:
ARFORMOTEROL TARTRATE CHEMBL605993 FORMOTEROL FUMARATE N-(2-Hydroxy-5-{1-hydroxy-2-[2-(4-methoxy-phenyl)-1-methyl-ethylamino]-ethyl}-phenyl)-formamide Symbicort | cid_9912089
Type:
Small organic molecule
Emp. Form.:
C19H24N2O4
Mol. Mass.:
344.4049
SMILES:
COc1ccc(C[C@@H](C)NC[C@H](O)c2ccc(O)c(NC=O)c2)cc1
: