Target
Alpha-2B adrenergic receptor
Ligand
BDBM50419875
Substrate
Meas. Tech.
ChEMBL_805962 (CHEMBL1960290)
EC50
240±n/a nM
Citation
 Diamanti, EDel Bello, FCarbonara, GCarrieri, AFracchiolla, GGiannella, MMammoli, VPiergentili, APohjanoksa, KQuaglia, WScheinin, MPigini, M Might the observeda(2A)-adrenoreceptor agonism or antagonism of allyphenyline analogues be ascribed to different molecular conformations? Bioorg Med Chem 20:2082-90 (2012)  
Target
Name:
Alpha-2B adrenergic receptor
Synonyms:
ADA2B_HUMAN ADRA2L1 Adrenergic alpha2B Adrenergic receptor alpha Alpha-2 adrenergic receptor subtype C2 Alpha-2B adrenoreceptor | Alpha-2BAR
Type:
Enzyme
Mol. Mass.:
49964.20
Organism:
Homo sapiens (Human)
Description:
P18089
Residue:
450
  
Inhibitor
Name:
BDBM50419875
Synonyms:
CHEMBL1956193
Type:
Small organic molecule
Emp. Form.:
C12H13F3N2O
Mol. Mass.:
258.2396
SMILES:
CC(Oc1ccccc1C(F)(F)F)C1=NCCN1
: