Target
ATP-dependent translocase ABCB1
Ligand
BDBM50378783
Substrate
Meas. Tech.
ChEMBL_838270 (CHEMBL2076218)
IC50
600±n/a nM
Citation
 Wang, EJCasciano, CNClement, RPJohnson, WW Active transport of fluorescent P-glycoprotein substrates: evaluation as markers and interaction with inhibitors. Biochem Biophys Res Commun 289:580-5 (2001)  
Target
Name:
ATP-dependent translocase ABCB1
Synonyms:
ABCB1 MDR1_HUMAN Multidrug resistance protein 1 P-glycoprotein (P-gp) PGY1
Type:
Protein
Mol. Mass.:
141503.50
Organism:
Homo sapiens (Human)
Description:
P08183
Residue:
1280
  
Inhibitor
Name:
BDBM50378783
Synonyms:
CLOFAZIMINE
Type:
Small organic molecule
Emp. Form.:
C27H22Cl2N4
Mol. Mass.:
473.396
SMILES:
CC(C)\N=c1/cc2n(-c3ccc(Cl)cc3)c3ccccc3nc2cc1Nc1ccc(Cl)cc1
: