Target
ATP-dependent translocase ABCB1
Ligand
BDBM50017376
Substrate
Meas. Tech.
ChEMBL_838270 (CHEMBL2076218)
IC50
1800±n/a nM
Citation
 Wang, EJCasciano, CNClement, RPJohnson, WW Active transport of fluorescent P-glycoprotein substrates: evaluation as markers and interaction with inhibitors. Biochem Biophys Res Commun 289:580-5 (2001)  
Target
Name:
ATP-dependent translocase ABCB1
Synonyms:
ABCB1 MDR1_HUMAN Multidrug resistance protein 1 P-glycoprotein (P-gp) PGY1
Type:
Protein
Mol. Mass.:
141503.50
Organism:
Homo sapiens (Human)
Description:
P08183
Residue:
1280
  
Inhibitor
Name:
BDBM50017376
Synonyms:
(+/-)1-(4-tert-butylphenyl)-4-(4-(hydroxydiphenylmethyl)piperidin-1-yl)butan-1-ol 1-(4-tert-Butyl-phenyl)-4-[4-(hydroxy-diphenyl-methyl)-piperidin-1-yl]-butan-1-ol(Terfenadine) CHEMBL17157 teraenadine
Type:
Small organic molecule
Emp. Form.:
C32H41NO2
Mol. Mass.:
471.6734
SMILES:
CC(C)(C)c1ccc(cc1)C(O)CCCN1CCC(CC1)C(O)(c1ccccc1)c1ccccc1
: