Target
ATP-dependent translocase ABCB1
Ligand
BDBM50367298
Substrate
Meas. Tech.
ChEMBL_838719 (CHEMBL2078545)
IC50
7100±n/a nM
Citation
 Wang, EJCasciano, CNClement, RPJohnson, WW Active transport of fluorescent P-glycoprotein substrates: evaluation as markers and interaction with inhibitors. Biochem Biophys Res Commun 289:580-5 (2001)  
Target
Name:
ATP-dependent translocase ABCB1
Synonyms:
ABCB1 MDR1_HUMAN Multidrug resistance protein 1 P-glycoprotein (P-gp) PGY1
Type:
Protein
Mol. Mass.:
141503.50
Organism:
Homo sapiens (Human)
Description:
P08183
Residue:
1280
  
Inhibitor
Name:
BDBM50367298
Synonyms:
Cardene | NICARDIPINE
Type:
Small organic molecule
Emp. Form.:
C26H29N3O6
Mol. Mass.:
479.525
SMILES:
COC(=O)C1C(C(C(=O)OCCN(C)Cc2ccccc2)=C(C)N=C1C)c1cccc(c1)[N+]([O-])=O
: