Target
Bile salt export pump
Ligand
BDBM50420225
Substrate
Meas. Tech.
ChEMBL_838278 (CHEMBL2076226)
IC50
7200±n/a nM
Citation
 Wang, EJCasciano, CNClement, RPJohnson, WW Fluorescent substrates of sister-P-glycoprotein (BSEP) evaluated as markers of active transport and inhibition: evidence for contingent unequal binding sites. Pharm Res 20:537-44 (2003)  
Target
Name:
Bile salt export pump
Synonyms:
ABCB11 ATP-binding cassette sub-family B member 11 Bile Salt Export Pump, BSEP Bile salt export pump (BSEP)
Type:
Protein
Mol. Mass.:
146405.49
Organism:
Homo sapiens (Human)
Description:
O95342
Residue:
1321
  
Inhibitor
Name:
BDBM50420225
Synonyms:
VALINOMYCIN | Valino
Type:
Small organic molecule
Emp. Form.:
C54H90N6O18
Mol. Mass.:
1111.3218
SMILES:
CC(C)C1NC(=O)C(C)OC(=O)C(NC(=O)C(OC(=O)C(NC(=O)C(C)OC(=O)C(NC(=O)C(OC(=O)C(NC(=O)C(C)OC(=O)C(NC(=O)C(OC1=O)C(C)C)C(C)C)C(C)C)C(C)C)C(C)C)C(C)C)C(C)C)C(C)C
: