Target
ATP-dependent translocase ABCB1
Ligand
BDBM14459
Substrate
Meas. Tech.
ChEMBL_837209 (CHEMBL2076753)
IC50
2700±n/a nM
Citation
 Wang, ECasciano, CNClement, RPJohnson, WW The farnesyl protein transferase inhibitor SCH66336 is a potent inhibitor of MDR1 product P-glycoprotein. Cancer Res 61:7525-9 (2001) Target
Name:
ATP-dependent translocase ABCB1
Synonyms:
ABCB1 MDR1_HUMAN Multidrug resistance protein 1 P-glycoprotein (P-gp) PGY1
Type:
Protein
Mol. Mass.:
141503.50
Organism:
Homo sapiens (Human)
Description:
P08183
Residue:
1280
  
Inhibitor
Name:
BDBM14459
Synonyms:
(+)-4-[2-[4-(8-Chloro-3,10-dibromo-6,11-dihydro-5H-benzo[5,6]cyclohepta[1,2-b]pyridin-11(R)-yl)-1-piperidin-yl]-2-oxo-ethyl]-1-piperidinecarboxamide CHEMBL298734 SCH 66336 | Sarasar
Type:
Small organic molecule
Emp. Form.:
C27H31Br2ClN4O2
Mol. Mass.:
638.822
SMILES:
NC(=O)N1CCC(CC(=O)N2CCC(CC2)[C@H]2c3ncc(Br)cc3CCc3cc(Cl)cc(Br)c23)CC1
: