Target
ATP-dependent translocase ABCB1
Ligand
BDBM50420225
Substrate
Meas. Tech.
ChEMBL_838292 (CHEMBL2076240)
IC50
3200±n/a nM
Citation
 Wang, ELew, KBarecki, MCasciano, CNClement, RPJohnson, WW Quantitative distinctions of active site molecular recognition by P-glycoprotein and cytochrome P450 3A4. Chem Res Toxicol 14:1596-603 (2001)  
Target
Name:
ATP-dependent translocase ABCB1
Synonyms:
ABCB1 MDR1_HUMAN Multidrug resistance protein 1 P-glycoprotein (P-gp) PGY1
Type:
Protein
Mol. Mass.:
141503.50
Organism:
Homo sapiens (Human)
Description:
P08183
Residue:
1280
  
Inhibitor
Name:
BDBM50420225
Synonyms:
VALINOMYCIN | Valino
Type:
Small organic molecule
Emp. Form.:
C54H90N6O18
Mol. Mass.:
1111.3218
SMILES:
CC(C)C1NC(=O)C(C)OC(=O)C(NC(=O)C(OC(=O)C(NC(=O)C(C)OC(=O)C(NC(=O)C(OC(=O)C(NC(=O)C(C)OC(=O)C(NC(=O)C(OC1=O)C(C)C)C(C)C)C(C)C)C(C)C)C(C)C)C(C)C)C(C)C)C(C)C
: