Target
ATP-dependent translocase ABCB1
Ligand
BDBM82061
Substrate
Meas. Tech.
ChEMBL_838292 (CHEMBL2076240)
IC50
3200±n/a nM
Citation
 Wang, ELew, KBarecki, MCasciano, CNClement, RPJohnson, WW Quantitative distinctions of active site molecular recognition by P-glycoprotein and cytochrome P450 3A4. Chem Res Toxicol 14:1596-603 (2001)  
Target
Name:
ATP-dependent translocase ABCB1
Synonyms:
ABCB1 MDR1_HUMAN Multidrug resistance protein 1 P-glycoprotein (P-gp) PGY1
Type:
Protein
Mol. Mass.:
141503.50
Organism:
Homo sapiens (Human)
Description:
P08183
Residue:
1280
  
Inhibitor
Name:
BDBM82061
Synonyms:
CAS_119442 GALLOPAMIL | NSC_119442
Type:
Small organic molecule
Emp. Form.:
C28H40N2O5
Mol. Mass.:
484.6276
SMILES:
COc1ccc(CCN(C)CCCC(C#N)(C(C)C)c2cc(OC)c(OC)c(OC)c2)cc1OC
: