Target
ATP-dependent translocase ABCB1
Ligand
BDBM50121977
Substrate
Meas. Tech.
ChEMBL_838292 (CHEMBL2076240)
IC50
900±n/a nM
Citation
 Wang, ELew, KBarecki, MCasciano, CNClement, RPJohnson, WW Quantitative distinctions of active site molecular recognition by P-glycoprotein and cytochrome P450 3A4. Chem Res Toxicol 14:1596-603 (2001)  
Target
Name:
ATP-dependent translocase ABCB1
Synonyms:
ABCB1 MDR1_HUMAN Multidrug resistance protein 1 P-glycoprotein (P-gp) PGY1
Type:
Protein
Mol. Mass.:
141503.50
Organism:
Homo sapiens (Human)
Description:
P08183
Residue:
1280
  
Inhibitor
Name:
BDBM50121977
Synonyms:
2-(3,4-Dimethoxy-phenyl)-5-[2-(3,4-dimethoxy-phenyl)-ethylamino]-2-isopropyl-pentanenitrile Norverapamil (6%)
Type:
Small organic molecule
Emp. Form.:
C26H36N2O4
Mol. Mass.:
440.575
SMILES:
COc1ccc(CCNCCCC(C#N)(C(C)C)c2ccc(OC)c(OC)c2)cc1OC
: