Target
Multidrug resistance-associated protein 1
Ligand
BDBM50420230
Substrate
Meas. Tech.
ChEMBL_837125 (CHEMBL2076526)
IC50
750±n/a nM
Citation
 Jedlitschky, GLeier, IBuchholz, UHummel-Eisenbeiss, JBurchell, BKeppler, D ATP-dependent transport of bilirubin glucuronides by the multidrug resistance protein MRP1 and its hepatocyte canalicular isoform MRP2. Biochem J 327:305-10 (1997)  
Target
Name:
Multidrug resistance-associated protein 1
Synonyms:
7.6.2.2 ABCC1 ATP-binding cassette, sub-family C, member 1 isoform 1 LTC4 transporter MRP MRP1_HUMAN
Type:
Mol. Mass.:
171597.72
Organism:
Homo sapiens (Human)
Description:
P33527
Residue:
1531
  
Inhibitor
Name:
BDBM50420230
Synonyms:
CHEMBL2074750
Type:
Small organic molecule
Emp. Form.:
C45H52N4O18
Mol. Mass.:
936.9104
SMILES:
CC1=C(C=C)\C(NC1=O)=C\c1[nH]c(Cc2[nH]c(\C=C3/NC(=O)C(C=C)=C3C)c(C)c2CCC(=O)OC2OC([C@H](O)C(O)C2O)C(O)=O)c(CCC(=O)O[C@@H]2OC([C@@H](O)C(O)C2O)C(O)=O)c1C
: