Target
Solute carrier family 22 member 1
Ligand
BDBM50403559
Substrate
Meas. Tech.
ChEMBL_836965 (CHEMBL2075805)
IC50
329000±n/a nM
Citation
 Okuda, MUrakami, YSaito, HInui, K Molecular mechanisms of organic cation transport in OCT2-expressing Xenopus oocytes. Biochim Biophys Acta 1417:224-31 (1999)  
Target
Name:
Solute carrier family 22 member 1
Synonyms:
Adrenaline alpha1 Organic cation transporter 1 Slc22a1 adrenergic Alpha1 | rOCT1
Type:
Enzyme Catalytic Domain
Mol. Mass.:
61538.40
Organism:
RAT
Description:
Adrenaline alpha1 0 RAT::Q63089
Residue:
556
  
Inhibitor
Name:
BDBM50403559
Synonyms:
Brumetadina | CIMETIDINE
Type:
Small organic molecule
Emp. Form.:
C10H16N6S
Mol. Mass.:
252.339
SMILES:
CNC(NCCSCc1[nH]cnc1C)=NC#N
: