Target
Solute carrier family 22 member 2
Ligand
BDBM50420177
Substrate
Meas. Tech.
ChEMBL_836109 (CHEMBL2077545)
IC50
1560000±n/a nM
Citation
 Okuda, MUrakami, YSaito, HInui, K Molecular mechanisms of organic cation transport in OCT2-expressing Xenopus oocytes. Biochim Biophys Acta 1417:224-31 (1999)  
Target
Name:
Solute carrier family 22 member 2
Synonyms:
Adrenaline alpha2 Organic cation transporter 2 Slc22a2 rOCT2
Type:
Enzyme Catalytic Domain
Mol. Mass.:
62348.38
Organism:
RAT
Description:
Adrenaline alpha2 0 RAT::Q9R0W2
Residue:
555
  
Inhibitor
Name:
BDBM50420177
Synonyms:
NICOTINYL METHYLAMIDE
Type:
Small organic molecule
Emp. Form.:
C7H8N2O
Mol. Mass.:
136.1512
SMILES:
CNC(=O)c1cccnc1
: