Target
Solute carrier family 22 member 2
Ligand
BDBM50026220
Substrate
Meas. Tech.
ChEMBL_836109 (CHEMBL2077545)
IC50
159000±n/a nM
Citation
 Okuda, MUrakami, YSaito, HInui, K Molecular mechanisms of organic cation transport in OCT2-expressing Xenopus oocytes. Biochim Biophys Acta 1417:224-31 (1999)  
Target
Name:
Solute carrier family 22 member 2
Synonyms:
Adrenaline alpha2 Organic cation transporter 2 Slc22a2 rOCT2
Type:
Enzyme Catalytic Domain
Mol. Mass.:
62348.38
Organism:
RAT
Description:
Adrenaline alpha2 0 RAT::Q9R0W2
Residue:
555
  
Inhibitor
Name:
BDBM50026220
Synonyms:
2-hydroxy-N,N,N-trimethylethanaminium CHEMBL293410 N-trimethylethanolamine choline | trimethylethanolamine
Type:
Small organic molecule
Emp. Form.:
C5H14NO
Mol. Mass.:
104.1702
SMILES:
C[N+](C)(C)CCO
: