Target
E3 ubiquitin-protein ligase Mdm2
Ligand
BDBM50420270
Substrate
Meas. Tech.
ChEMBL_841972 (CHEMBL2091389)
Ki
>100000±n/a nM
Citation
 Guo, ZZhuang, CZhu, LZhang, YYao, JDong, GWang, SLiu, YChen, HSheng, CMiao, ZZhang, W Structure-activity relationship and antitumor activity of thio-benzodiazepines as p53-MDM2 protein-protein interaction inhibitors. Eur J Med Chem 56:10-16 (2012)  
Target
Name:
E3 ubiquitin-protein ligase Mdm2
Synonyms:
Double minute 2 protein E3 ubiquitin-protein ligase Mdm2 (p53-binding protein Mdm2) Human Double Minute 2 (HDM2) MDM2-MDMX p53-Binding Protein MDM2 | p53-binding protein
Type:
Oncoprotein
Mol. Mass.:
55196.54
Organism:
Homo sapiens (Human)
Description:
Q00987
Residue:
491
  
Inhibitor
Name:
BDBM50420270
Synonyms:
CHEMBL2089205
Type:
Small organic molecule
Emp. Form.:
C25H20Cl2N2O4S
Mol. Mass.:
515.408
SMILES:
COC(=O)C(N1C(c2ccc(Cl)cc2)C(=S)Nc2cc(OC)ccc2C1=O)c1ccc(Cl)cc1
: