Target
Cyclin-T1/Cyclin-dependent kinase 9
Ligand
BDBM50420299
Substrate
Meas. Tech.
ChEMBL_839632 (CHEMBL2090653)
IC50
450±n/a nM
Citation
 Bettayeb, KGresh, NMeijer, LOumata, N Synthesis and biological evaluation of selective and potent cyclin-dependent kinase inhibitors. Eur J Med Chem 56:210-216 (2012)  
Target
Name:
Cyclin-T1/Cyclin-dependent kinase 9
Synonyms:
CDK9/ Cyclin-T1 CDK9/Cyclin T Cyclin T1/dependent kinase 9 | Cyclin-Dependent Kinase 9 (CDK9)
Type:
Protein Complex
Mol. Mass.:
Description:
Components:
This complex has 2 components.
Component 1
Name:
Cyclin-T1
Synonyms:
CCNT1 CycT Cyclin T Cyclin-T
Type:
Enzyme Subunit
Mol. Mass.:
80712.40
Organism:
Homo sapiens (Human)
Description:
Residue:
726
  
Component 2
Name:
Cyclin-dependent kinase 9
Synonyms:
C-2K CDK9 Cell division cycle 2-like protein kinase 4 Cyclin-Dependent Kinase 9 (CDK9) Serine/threonine-protein kinase PITALRE Tat-associated kinase complex catalytic subunit
Type:
Enzyme Subunit
Mol. Mass.:
42789.13
Organism:
Homo sapiens (Human)
Description:
Residue:
372
  
Inhibitor
Name:
BDBM50420299
Synonyms:
CHEMBL2089034
Type:
Small organic molecule
Emp. Form.:
C25H29N7O2
Mol. Mass.:
459.5435
SMILES:
CC(C)n1cnc2c(NCc3ccc(cc3)-c3ccccn3)nc(nc12)N1C[C@H](O)C[C@H]1CO
: