Target
Dual specificity tyrosine-phosphorylation-regulated kinase 1A
Ligand
BDBM50420299
Substrate
Meas. Tech.
ChEMBL_839752 (CHEMBL2089674)
IC50
1600±n/a nM
Citation
 Bettayeb, KGresh, NMeijer, LOumata, N Synthesis and biological evaluation of selective and potent cyclin-dependent kinase inhibitors. Eur J Med Chem 56:210-216 (2012)  
Target
Name:
Dual specificity tyrosine-phosphorylation-regulated kinase 1A
Synonyms:
DYR1A_HUMAN DYRK1A Dual specificity YAK1-related kinase 1A (Dyrk1A) Dual-specificity tyrosine-phosphorylation regulated kinase 1A HP86 MNBH
Type:
Enzyme
Mol. Mass.:
85616.61
Organism:
Homo sapiens (Human)
Description:
Q13627
Residue:
763
  
Inhibitor
Name:
BDBM50420299
Synonyms:
CHEMBL2089034
Type:
Small organic molecule
Emp. Form.:
C25H29N7O2
Mol. Mass.:
459.5435
SMILES:
CC(C)n1cnc2c(NCc3ccc(cc3)-c3ccccn3)nc(nc12)N1C[C@H](O)C[C@H]1CO
: