Target
Phosphatidylinositol 4,5-bisphosphate 3-kinase catalytic subunit beta isoform
Ligand
BDBM50420312
Substrate
Meas. Tech.
ChEMBL_839975 (CHEMBL2090371)
EC50
9±n/a nM
Citation
 Lin, HSchulz, MJXie, RZeng, JLuengo, JISquire, MDTedesco, RQu, JErhard, KMack, JFRaha, KPlant, RRominger, CMAriazi, JLSherk, CSSchaber, MDMcSurdy-Freed, JSpengler, MDDavis, CBHardwicke, MARivero, RA Rational Design, Synthesis, and SAR of a Novel Thiazolopyrimidinone Series of Selective PI3K-beta Inhibitors. ACS Med Chem Lett 3:524-529 (2012)  
Target
Name:
Phosphatidylinositol 4,5-bisphosphate 3-kinase catalytic subunit beta isoform
Synonyms:
PI3-kinase p110 subunit beta PI3Kbeta PIK3CB Phosphatidylinositol 4,5-bisphosphate 3-kinase catalytic subunit beta (PI3Kbeta) Phosphatidylinositol 4,5-bisphosphate 3-kinase catalytic subunit beta isoform (PI3K) Phosphatidylinositol 4,5-bisphosphate 3-kinase catalytic subunit beta isoform (PI3Kbeta) Phosphatidylinositol-4,5-bisphosphate 3-kinase catalytic subunit beta isoform Phosphoinositide 3-Kinase (PI3K), beta Chain A PtdIns-3-kinase p110
Type:
Enzyme Subunit
Mol. Mass.:
122769.00
Organism:
Homo sapiens (Human)
Description:
P42338
Residue:
1070
  
Inhibitor
Name:
BDBM50420312
Synonyms:
CHEMBL2089109
Type:
Small organic molecule
Emp. Form.:
C21H21F3N4O2S
Mol. Mass.:
450.477
SMILES:
Cc1c(Cn2c(nc(=O)c3sc(nc23)N2CCOCC2)C2CC2)cccc1C(F)(F)F
: