Target
Suppressor of tumorigenicity 14 protein
Ligand
BDBM50420339
Substrate
Meas. Tech.
ChEMBL_840131 (CHEMBL2090834)
Ki
6124±n/a nM
Citation
 Colombo, EDésilets, ADuchêne, DChagnon, FNajmanovich, RLeduc, RMarsault, E Design and synthesis of potent, selective inhibitors of matriptase. ACS Med Chem Lett 3:530-534 (2012)  
Target
Name:
Suppressor of tumorigenicity 14 protein
Synonyms:
Epithin MT-SP1 PRSS14 SNC19 ST14_HUMAN Suppressor of tumorigenicity 14 protein TADG15
Type:
Single-pass type II membrane protein
Mol. Mass.:
94769.23
Organism:
Homo sapiens (Human)
Description:
Q9Y5Y6
Residue:
855
  
Inhibitor
Name:
BDBM50420339
Synonyms:
CHEMBL2089121
Type:
Small organic molecule
Emp. Form.:
C27H44N12O5S
Mol. Mass.:
648.781
SMILES:
[#6]-[#6@H](-[#7]-[#6](=O)-[#6@H](-[#6]-[#6]-[#6](-[#7])=O)-[#7]-[#6](=O)-[#6@@H](-[#7])-[#6]-[#6]-[#6]\[#7]=[#6](\[#7])-[#7])-[#6](=O)-[#7]-[#6@@H](-[#6]-[#6]-[#6]\[#7]=[#6](\[#7])-[#7])-[#6](-[#8])-c1nc2ccccc2s1
: