Target
Prothrombin
Ligand
BDBM50420334
Substrate
Meas. Tech.
ChEMBL_840136 (CHEMBL2090839)
Ki
637±n/a nM
Citation
 Colombo, EDésilets, ADuchêne, DChagnon, FNajmanovich, RLeduc, RMarsault, E Design and synthesis of potent, selective inhibitors of matriptase. ACS Med Chem Lett 3:530-534 (2012)  
Target
Name:
Prothrombin
Synonyms:
Activation peptide fragment 1 Coagulation factor II Prothrombin precursor Thrombin heavy chain | Thrombin light chain
Type:
Protein
Mol. Mass.:
70029.57
Organism:
Homo sapiens (Human)
Description:
P00734
Residue:
622
  
Inhibitor
Name:
BDBM50420334
Synonyms:
CHEMBL2086421
Type:
Small organic molecule
Emp. Form.:
C27H42N12O5S
Mol. Mass.:
646.765
SMILES:
[#6]-[#6@H](-[#7]-[#6](=O)-[#6@H](-[#6]-[#6]-[#6](-[#7])=O)-[#7]-[#6](=O)-[#6@@H](-[#7])-[#6]-[#6]-[#6]\[#7]=[#6](\[#7])-[#7])-[#6](=O)-[#7]-[#6@@H](-[#6]-[#6]-[#6]\[#7]=[#6](\[#7])-[#7])-[#6](=O)-c1nc2ccccc2s1
: