Target
Snake venom metalloproteinase BaP1
Ligand
BDBM50420347
Substrate
Meas. Tech.
ChEMBL_840308 (CHEMBL2091265)
IC50
46200±n/a nM
Citation
 Villalta-Romero, FGortat, AHerrera, AEArguedas, RQuesada, Jde Melo, RLCalvete, JJMontero, MMurillo, RRucavado, AGutiérrez, JMPérez-Payá, E Identification of new snake venom metalloproteinase inhibitors using compound screening and rational Peptide design. ACS Med Chem Lett 3:540-543 (2012)  
Target
Name:
Snake venom metalloproteinase BaP1
Synonyms:
Bap-1 SVMP | VM1B1_BOTAS
Type:
PROTEIN
Mol. Mass.:
45929.07
Organism:
Bothrops asper
Description:
ChEMBL_840308
Residue:
408
  
Inhibitor
Name:
BDBM50420347
Synonyms:
CHEMBL2089168
Type:
Small organic molecule
Emp. Form.:
C26H33N5O5
Mol. Mass.:
495.5707
SMILES:
CC(C)C[C@H](NC(=O)[C@@H](N)Cc1c[nH]c2ccccc12)C(=O)N[C@@H](Cc1ccc(O)cc1)C(=O)NO
: