Target
Snake venom metalloproteinase BaP1
Ligand
BDBM50420350
Substrate
Meas. Tech.
ChEMBL_840308 (CHEMBL2091265)
IC50
88100±n/a nM
Citation
 Villalta-Romero, FGortat, AHerrera, AEArguedas, RQuesada, Jde Melo, RLCalvete, JJMontero, MMurillo, RRucavado, AGutiérrez, JMPérez-Payá, E Identification of new snake venom metalloproteinase inhibitors using compound screening and rational Peptide design. ACS Med Chem Lett 3:540-543 (2012)  
Target
Name:
Snake venom metalloproteinase BaP1
Synonyms:
Bap-1 SVMP | VM1B1_BOTAS
Type:
PROTEIN
Mol. Mass.:
45929.07
Organism:
Bothrops asper
Description:
ChEMBL_840308
Residue:
408
  
Inhibitor
Name:
BDBM50420350
Synonyms:
Actin-N Furacin NITROFURAZONE | Nitrofural
Type:
Small organic molecule
Emp. Form.:
C6H6N4O4
Mol. Mass.:
198.1362
SMILES:
NC(=O)NN=Cc1ccc(o1)[N+]([O-])=O
: