Target
Snake venom metalloproteinase BaP1
Ligand
BDBM50420357
Substrate
Meas. Tech.
ChEMBL_840308 (CHEMBL2091265)
IC50
825000±n/a nM
Citation
 Villalta-Romero, FGortat, AHerrera, AEArguedas, RQuesada, Jde Melo, RLCalvete, JJMontero, MMurillo, RRucavado, AGutiérrez, JMPérez-Payá, E Identification of new snake venom metalloproteinase inhibitors using compound screening and rational Peptide design. ACS Med Chem Lett 3:540-543 (2012)  
Target
Name:
Snake venom metalloproteinase BaP1
Synonyms:
Bap-1 SVMP | VM1B1_BOTAS
Type:
PROTEIN
Mol. Mass.:
45929.07
Organism:
Bothrops asper
Description:
ChEMBL_840308
Residue:
408
  
Inhibitor
Name:
BDBM50420357
Synonyms:
CHEMBL2089162
Type:
Small organic molecule
Emp. Form.:
C24H32N4O3
Mol. Mass.:
424.5359
SMILES:
CC(C)C[C@H](NC(=O)[C@@H](N)Cc1ccccc1)C(=O)N[C@@H](Cc1ccccc1)C(N)=O
: