Target
Protein-glutamine gamma-glutamyltransferase 6
Ligand
BDBM50420459
Substrate
Meas. Tech.
ChEMBL_841040 (CHEMBL2091166)
IC50
840±n/a nM
Citation
 Prime, MEAndersen, OABarker, JJBrooks, MACheng, RKToogood-Johnson, ICourtney, SMBrookfield, FAYarnold, CJMarston, RWJohnson, PDJohnsen, SFPalfrey, JJVaidya, DErfan, SIchihara, OFelicetti, BPalan, SPedret-Dunn, ASchaertl, SSternberger, IEbneth, AScheel, AWinkler, DToledo-Sherman, LBeconi, MMacdonald, DMuñoz-Sanjuan, IDominguez, CWityak, J Discovery and structure-activity relationship of potent and selective covalent inhibitors of transglutaminase 2 for Huntington's disease. J Med Chem 55:1021-46 (2012)  
Target
Name:
Protein-glutamine gamma-glutamyltransferase 6
Synonyms:
Protein-glutamine gamma-glutamyltransferase 6 TGM3L TGM6 TGase Y TGase-6 Transglutaminase-3-like Transglutaminase-6 (TG6)
Type:
Protein
Mol. Mass.:
79319.01
Organism:
Homo sapiens (Human)
Description:
Residue:
706
  
Inhibitor
Name:
BDBM50420459
Synonyms:
CHEMBL2086528
Type:
Small organic molecule
Emp. Form.:
C24H31N3O4S
Mol. Mass.:
457.586
SMILES:
C=CC(=O)Nc1ccc(cc1)S(=O)(=O)N1CCN(CC1)C(=O)C12CC3CC(CC(C3)C1)C2
: