Target
Serine/threonine-protein kinase mTOR
Ligand
BDBM36609
Substrate
Meas. Tech.
ChEBML_66424
IC50
3.5±n/a nM
Citation
 Rabinowitz, MSeneci, PRossi, TDal Cin, MDeal, MTerstappen, G Solid-phase/solution-phase combinatorial synthesis of neuroimmunophilin ligands. Bioorg Med Chem Lett 10:1007-10 (2000)  
Target
Name:
Serine/threonine-protein kinase mTOR
Synonyms:
FK506-binding protein 12-rapamycin complex-associated protein 1 FRAP FRAP1 MTOR Mammalian Target of Rapamycin (mTOR) RAFT1 Rapamycin and FKBP12 target 1 Serine/threonine-protein kinase (mTOR) | mTORC2
Type:
Rapamycin target protein
Mol. Mass.:
288917.12
Organism:
Homo sapiens (Human)
Description:
P42345
Residue:
2549
  
Inhibitor
Name:
BDBM36609
Synonyms:
Rapamycin C-7, analog 4 US11603377, Compound Ramycin
Type:
Small organic molecule
Emp. Form.:
C51H79NO13
Mol. Mass.:
914.1719
SMILES:
CO[C@@H]1C[C@H](C[C@@H](C)[C@@H]2CC(=O)[C@H](C)\C=C(C)\[C@@H](O)[C@@H](OC)C(=O)[C@H](C)C[C@H](C)\C=C\C=C\C=C(C)\[C@H](C[C@@H]3CC[C@@H](C)[C@@](O)(O3)C(=O)C(=O)N3CCCC[C@H]3C(=O)O2)OC)CC[C@H]1O
: