Target
Renin
Ligand
BDBM50421776
Substrate
Meas. Tech.
ChEBML_154901
IC50
120±n/a nM
Citation
 Nisato, DWagnon, JCallet, GMettefeu, DAssens, JLPlouzane, CTonnerre, BPliska, VFauchère, JL Renin inhibitors. Free-Wilson and correlation analysis of the inhibitory potency of a series of pepstatin analogues on plasma renin. J Med Chem 30:2287-91 (1988)  
Target
Name:
Renin
Synonyms:
Angiotensinogenase RENI_HUMAN
Type:
Enzyme
Mol. Mass.:
45058.99
Organism:
Homo sapiens (Human)
Description:
Residue:
406
  
Inhibitor
Name:
BDBM50421776
Synonyms:
CHEMBL310597 | CHEMBL3142315
Type:
Small organic molecule
Emp. Form.:
C45H66N6O10
Mol. Mass.:
851.0397
SMILES:
COC(=O)C[C@H](O)[C@H](CC(C)C)NC(=O)[C@H](C)NC(=O)C[C@H](O)[C@H](CC(C)C)NC(=O)[C@H](Cc1c[nH]c2ccccc12)NC(=O)[C@H](Cc1ccccc1)NC(=O)OC(C)(C)C
: