Target
Integrin alpha-IIb/beta-3
Ligand
BDBM50287281
Substrate
Meas. Tech.
ChEMBL_30133 (CHEMBL641175)
IC50
269±n/a nM
Citation
 Tanaka, AFujiwara, H Quantitative structure-activity relationship study of fibrinogen inhibitors, [[4-(4-amidinophenoxy)butanoyl]aspartyl]valine (FK633) derivatives, using a novel hydrophobic descriptor. J Med Chem 39:5017-20 (1997)  
Target
Name:
Integrin alpha-IIb/beta-3
Synonyms:
Glycoprotein IIb/IIIa
Type:
Mol. Mass.:
Description:
ASSAY_ID of EBI is 30109
Components:
This complex has 2 components.
Component 1
Name:
Integrin beta-3
Synonyms:
CD_antigen=CD61 GPIIIa ITGB3 Platelet membrane glycoprotein IIIa
Type:
Protein
Mol. Mass.:
87038.91
Organism:
Homo sapiens (Human)
Description:
P05106
Residue:
788
  
Component 2
Name:
Integrin alpha-IIb
Synonyms:
CD_antigen=CD41 GPIIb Glycoprotein IIb ITGA2B Integrin alpha-IIb heavy chain Integrin alpha-IIb light chain, form 2 Integrin alpha-V/beta-3 and alpha-IIb/beta 3 | Platelet membrane glycoprotein IIb
Type:
Protein
Mol. Mass.:
113354.85
Organism:
Homo sapiens (Human)
Description:
P08514
Residue:
1039
  
Inhibitor
Name:
BDBM50287281
Synonyms:
(S)-3-[5-(4-Carbamimidoyl-phenoxy)-pentanoylamino]-N-[(S)-1-carboxy-2-(4-hydroxy-phenyl)-ethyl]-N-methyl-succinamic acid | CHEMBL264492
Type:
Small organic molecule
Emp. Form.:
C26H32N4O8
Mol. Mass.:
528.5543
SMILES:
CN([C@@H](Cc1ccc(O)cc1)C(O)=O)C(=O)[C@H](CC(O)=O)NC(=O)CCCCOc1ccc(cc1)C(N)=N
: