Target
Integrin alpha-IIb/beta-3
Ligand
BDBM50287288
Substrate
Meas. Tech.
ChEMBL_30241 (CHEMBL644380)
IC50
76±n/a nM
Citation
 Tanaka, AFujiwara, H Quantitative structure-activity relationship study of fibrinogen inhibitors, [[4-(4-amidinophenoxy)butanoyl]aspartyl]valine (FK633) derivatives, using a novel hydrophobic descriptor. J Med Chem 39:5017-20 (1997)  
Target
Name:
Integrin alpha-IIb/beta-3
Synonyms:
Glycoprotein IIb/IIIa
Type:
Mol. Mass.:
Description:
ASSAY_ID of EBI is 30109
Components:
This complex has 2 components.
Component 1
Name:
Integrin beta-3
Synonyms:
CD_antigen=CD61 GPIIIa ITGB3 Platelet membrane glycoprotein IIIa
Type:
Protein
Mol. Mass.:
87038.91
Organism:
Homo sapiens (Human)
Description:
P05106
Residue:
788
  
Component 2
Name:
Integrin alpha-IIb
Synonyms:
CD_antigen=CD41 GPIIb Glycoprotein IIb ITGA2B Integrin alpha-IIb heavy chain Integrin alpha-IIb light chain, form 2 Integrin alpha-V/beta-3 and alpha-IIb/beta 3 | Platelet membrane glycoprotein IIb
Type:
Protein
Mol. Mass.:
113354.85
Organism:
Homo sapiens (Human)
Description:
P08514
Residue:
1039
  
Inhibitor
Name:
BDBM50287288
Synonyms:
(S)-2-{(S)-2-[4-(4-Carbamimidoyl-phenoxy)-butyrylamino]-3-carboxy-propionylamino}-hexanoic acid | CHEMBL36406
Type:
Small organic molecule
Emp. Form.:
C21H30N4O7
Mol. Mass.:
450.4855
SMILES:
CCCC[C@H](NC(=O)[C@H](CC(O)=O)NC(=O)CCCOc1ccc(cc1)C(N)=N)C(O)=O
: