Target
Farnesyl pyrophosphate synthase
Ligand
BDBM50135831
Substrate
Meas. Tech.
ChEMBL_194806 (CHEMBL799889)
IC50
3.3±n/a nM
Citation
 Kotsikorou, EOldfield, E A quantitative structure-activity relationship and pharmacophore modeling investigation of aryl-X and heterocyclic bisphosphonates as bone resorption agents. J Med Chem 46:2932-44 (2003)  
Target
Name:
Farnesyl pyrophosphate synthase
Synonyms:
Dimethylallyltranstransferase FPP synthase FPPS_HUMAN Farnesyl diphosphate synthase Farnesyl diphosphate synthetase Farnesyl pyrophosphate synthetase KIAA1293 | P14324
Type:
Enzyme
Mol. Mass.:
48272.89
Organism:
Homo sapiens (Human)
Description:
P14324
Residue:
419
  
Inhibitor
Name:
BDBM50135831
Synonyms:
CHEMBL316844 | [1-Hydroxy-3-(3-phenoxy-propylamino)-1-phosphono-propyl]-phosphonic acid
Type:
Small organic molecule
Emp. Form.:
C12H21NO8P2
Mol. Mass.:
369.2446
SMILES:
OC(CCNCCCOc1ccccc1)(P(O)(O)=O)P(O)(O)=O
: