Target
Farnesyl pyrophosphate synthase
Ligand
BDBM50422454
Substrate
Meas. Tech.
ChEMBL_194806 (CHEMBL799889)
IC50
2.8±n/a nM
Citation
 Kotsikorou, EOldfield, E A quantitative structure-activity relationship and pharmacophore modeling investigation of aryl-X and heterocyclic bisphosphonates as bone resorption agents. J Med Chem 46:2932-44 (2003)  
Target
Name:
Farnesyl pyrophosphate synthase
Synonyms:
Dimethylallyltranstransferase FPP synthase FPPS_HUMAN Farnesyl diphosphate synthase Farnesyl diphosphate synthetase Farnesyl pyrophosphate synthetase KIAA1293 | P14324
Type:
Enzyme
Mol. Mass.:
48272.89
Organism:
Homo sapiens (Human)
Description:
P14324
Residue:
419
  
Inhibitor
Name:
BDBM50422454
Synonyms:
CHEMBL316913
Type:
Small organic molecule
Emp. Form.:
C14H25NO9P2
Mol. Mass.:
413.2971
SMILES:
COc1ccc(OCCCN(C)CCC(O)(P(O)(O)=O)P(O)(O)=O)cc1
: