Target
Farnesyl pyrophosphate synthase
Ligand
BDBM50422463
Substrate
Meas. Tech.
ChEMBL_194806 (CHEMBL799889)
IC50
2.0±n/a nM
Citation
 Kotsikorou, EOldfield, E A quantitative structure-activity relationship and pharmacophore modeling investigation of aryl-X and heterocyclic bisphosphonates as bone resorption agents. J Med Chem 46:2932-44 (2003)  
Target
Name:
Farnesyl pyrophosphate synthase
Synonyms:
Dimethylallyltranstransferase FPP synthase FPPS_HUMAN Farnesyl diphosphate synthase Farnesyl diphosphate synthetase Farnesyl pyrophosphate synthetase KIAA1293 | P14324
Type:
Enzyme
Mol. Mass.:
48272.89
Organism:
Homo sapiens (Human)
Description:
P14324
Residue:
419
  
Inhibitor
Name:
BDBM50422463
Synonyms:
CHEMBL101207
Type:
Small organic molecule
Emp. Form.:
C6H12N2O7P2
Mol. Mass.:
286.1162
SMILES:
Cn1ccnc1CC(O)(P(O)(O)=O)P(O)(O)=O
: